BDBM155110 US9000182, 17
SMILES CC(C)O[C@H]1CC[C@@]2(Cc3ccc(OCCCF)cc3C22N=C(C)C(N)=N2)CC1
InChI Key InChIKey=MNSXGYMIYOIUBX-VYNBAUGJSA-N
Data  1 IC50
  Tab Delimited (TSV)   2D SDfile   Computed 3D by Vconf -m prep SDfile
Find this compound or compounds like it in BindingDB:
Activity Spreadsheet -- Enzyme Inhibition Constant Data from BindingDB
Found 1 hit for monomerid = 155110
TargetBeta-secretase 1(Homo sapiens (Human))
Astrazeneca
US Patent
LigandPNGBDBM155110(US9000182, 17)
Affinity DataIC50:  250nMpH: 2.5Assay Description:The beta -secretase enzyme used in the TR-FRET is prepared as follows:The cDNA for the soluble part of the human (3-Secretase (AA 1-AA 460) was clone...
In DepthDetails US Patent