BDBM155125 US9000183, 9 Isomer 2
SMILES CO[C@H]1CC[C@@]2(Cc3cc(F)c(cc3[C@]22N=C(C)C(N)=N2)-c2cc(F)cc(c2)C#N)CC1
InChI Key InChIKey=WNIDBJOQKWEFFV-UKDVSSAZSA-N
Data  1 IC50
  Tab Delimited (TSV)   2D SDfile   Computed 3D by Vconf -m prep SDfile
Find this compound or compounds like it in BindingDB:
Activity Spreadsheet -- Enzyme Inhibition Constant Data from BindingDB
Found 1 hit for monomerid = 155125
TargetBeta-secretase 1(Homo sapiens (Human))
Astrazeneca
US Patent
LigandPNGBDBM155125(US9000183, 9 Isomer 2)
Affinity DataIC50: >5.00E+3nMpH: 2.5Assay Description:The beta -secretase enzyme used in the TR-FRET is prepared as follows:The cDNA for the soluble part of the human beta -Secretase (AA 1-AA 460) was cl...
In DepthDetails US Patent