BDBM155139 US9000184, 9
SMILES CC1=NC2(N=C1N)c1cc(ccc1CCC21CC1)-c1cc(Cl)cc(c1)C#N
InChI Key InChIKey=PKBFNKHRNBOEGL-UHFFFAOYSA-N
Data  2 IC50
  Tab Delimited (TSV)   2D SDfile   Computed 3D by Vconf -m prep SDfile
Find this compound or compounds like it in BindingDB:
Activity Spreadsheet -- Enzyme Inhibition Constant Data from BindingDB
Found 2 hits for monomerid = 155139
TargetAmyloid-beta precursor protein(Homo sapiens (Human))
Astrazeneca
US Patent
LigandPNGBDBM155139(US9000184, 9)
Affinity DataIC50:  16nMT: 2°C. Assay description: SH-SY5Y cells were cultured in DMEM/F-12 with Glutamax, 10% FCS and 1% non-essential amino acids and cryopreserved and stored at -140 C. at a concent...
In DepthDetails US Patent
TargetBeta-secretase 1(Homo sapiens (Human))
Astrazeneca
US Patent
LigandPNGBDBM155139(US9000184, 9)
Affinity DataIC50:  15nMpH: 2.5Assay Description:TR-FRET Assay: The beta -secretase enzyme used in the TR-FRET is prepared as follows:The cDNA for the soluble part of the human beta -Secretase (AA 1...
In DepthDetails US Patent