BDBM155179 US9006232, 1.213
SMILES Cn1c(OC2CCN(CC2)c2ccc(CN3CCOCC3)cc2)nc(cc1=O)-c1ccncn1
InChI Key InChIKey=ABAWKALESDIVHA-UHFFFAOYSA-N
Data  1 IC50
  Tab Delimited (TSV)   2D SDfile   Computed 3D by Vconf -m prep SDfile
Find this compound or compounds like it in BindingDB:
Activity Spreadsheet -- Enzyme Inhibition Constant Data from BindingDB
Found 1 hit for monomerid = 155179
TargetGlycogen synthase kinase-3 beta(Bos taurus (cattle))
Mitsubishi Tanabe Pharma
US Patent
LigandPNGBDBM155179(US9006232, 1.213)
Affinity DataIC50:  19.4nMpH: 6.5 T: 2°C. Assay description: A mixture containing 100 mM MES-sodium hydroxide (pH 6.5), 1 mM magnesium acetate, 0.5 mM EGTA, 5 mM, .beta.-mercaptoethanol, 0.02% Tween 20, 10% gly...
In DepthDetails US Patent