BDBM155192 US9006232, 1.226
SMILES CN1Cc2ccc(cc2C1)N1CCC(CC1)Oc1nc(cc(=O)n1C)-c1ccncn1
InChI Key InChIKey=XGLZMUQGQRMNOJ-UHFFFAOYSA-N
Data  1 IC50
  Tab Delimited (TSV)   2D SDfile   Computed 3D by Vconf -m prep SDfile
Find this compound or compounds like it in BindingDB:
Activity Spreadsheet -- Enzyme Inhibition Constant Data from BindingDB
Found 1 hit for monomerid = 155192
TargetGlycogen synthase kinase-3 beta(Bos taurus (cattle))
Mitsubishi Tanabe Pharma
US Patent
LigandPNGBDBM155192(US9006232, 1.226)
Affinity DataIC50:  23.7nMpH: 6.5 T: 2°C. Assay description: A mixture containing 100 mM MES-sodium hydroxide (pH 6.5), 1 mM magnesium acetate, 0.5 mM EGTA, 5 mM, .beta.-mercaptoethanol, 0.02% Tween 20, 10% gly...
In DepthDetails US Patent