BDBM1554 2-cyclopropyl-9-methyl-5-(1H-pyrrol-3-yl)-2,4,9,15-tetraazatricyclo[9.4.0.0^{3,8}]pentadeca-1(11),3,5,7,12,14-hexaen-10-one::Dipyridodiazepinone deriv. 43
SMILES CN1c2ccc(nc2N(C2CC2)c2ncccc2C1=O)-c1cc[nH]c1
InChI Key InChIKey=GISQDTWWOXOIKD-UHFFFAOYSA-N
Data  2 IC50
  Tab Delimited (TSV)   2D SDfile   Computed 3D by Vconf -m prep SDfile
Find this compound or compounds like it in BindingDB:
Activity Spreadsheet -- Enzyme Inhibition Constant Data from BindingDB
Found 2 hits for monomerid = 1554
TargetGag-Pol polyprotein [600-1027,Y780C]/[600-1155,Y780C](Human immunodeficiency virus type 1)
Boehringer Ingelheim Pharmaceuticals
LigandPNGBDBM1554(2-cyclopropyl-9-methyl-5-(1H-pyrrol-3-yl)-2,4,9,15...)
Affinity DataIC50:  60nM. Assay description: The IC50 of reverse transcriptase is the concentration that inhibits 50% of recombinant HIV-1 RT RNA-directed DNA polymerase activity in vitro.
In DepthDetails ArticlePubMed
TargetGag-Pol polyprotein [600-1027,R876K]/[600-1155](Human immunodeficiency virus type 1)
Boehringer Ingelheim Pharmaceuticals
LigandPNGBDBM1554(2-cyclopropyl-9-methyl-5-(1H-pyrrol-3-yl)-2,4,9,15...)
Affinity DataIC50:  50nM. Assay description: The IC50 of reverse transcriptase is the concentration that inhibits 50% of recombinant HIV-1 RT RNA-directed DNA polymerase activity in vitro.
In DepthDetails ArticlePubMed