BDBM155505 US9006454, I147
SMILES Cc1cc(C(O)=O)c2nc([nH]c2c1)-c1ccc(cc1)-c1cnccn1
InChI Key InChIKey=XFGLGTNMXMEMMZ-UHFFFAOYSA-N
Data  1 IC50
  Tab Delimited (TSV)   2D SDfile   Computed 3D by Vconf -m prep SDfile
Find this compound or compounds like it in BindingDB:
Activity Spreadsheet -- Enzyme Inhibition Constant Data from BindingDB
Found 1 hit for monomerid = 155505
TargetDihydroorotate dehydrogenase (quinone), mitochondrial(Homo sapiens (Human))
Merck Serono
US Patent
LigandPNGBDBM155505(US9006454, I147)
Affinity DataIC50:  8.45E+3nMpH: 8.0Assay Description:The DHODH activity assay is a coupled enzyme assay in which oxidation of DHO and subsequent reduction of ubiquinone are stoichiometrically equivalent...
In DepthDetails US Patent