BDBM155509 US9011882, Table 1, Compound 2
SMILES OC(=O)c1ccc(cc1)N1C(=O)C=CC1=O
InChI Key InChIKey=LKUOJDGRNKVVFF-UHFFFAOYSA-N
Data  1 IC50
  Tab Delimited (TSV)   2D SDfile   Computed 3D by Vconf -m prep SDfile
Find this compound or compounds like it in BindingDB:
Activity Spreadsheet -- Enzyme Inhibition Constant Data from BindingDB
Found 1 hit for monomerid = 155509
TargetN(G),N(G)-dimethylarginine dimethylaminohydrolase 1(Homo sapiens (Human))
The Board Of Trustees Of The Leland Stanford Junior University
US Patent
LigandPNGBDBM155509(US9011882, Table 1, Compound 2)
Affinity DataIC50:  2.33E+4nM. Assay description: The L-citrulline assay was based upon an original test-tube method developed by Prescott and Jones in 1969 (Prescott, L. M. & Jones, M. E. Modified m...
In DepthDetails US Patent