BDBM155711 US9012651, 144
SMILES COCC(CO)NCc1ccnc(n1)-c1ccc(cc1)C(F)(F)F
InChI Key InChIKey=ZSRMLZRXUWZZKL-UHFFFAOYSA-N
Data  1 IC50
  Tab Delimited (TSV)   2D SDfile   Computed 3D by Vconf -m prep SDfile
Find this compound or compounds like it in BindingDB:
Activity Spreadsheet -- Enzyme Inhibition Constant Data from BindingDB
Found 1 hit for monomerid = 155711
TargetTransient receptor potential cation channel subfamily V member 3(Homo sapiens (Human))
Abbvie
US Patent
LigandPNGBDBM155711(US9012651, 144)
Affinity DataIC50:  1.56E+4nM. Assay description: Experiments were conducted using the FLIPRTETRAŽ. On the day prior to the experiment, recombinant HEK293 cells that stably express human and mouse TR...
In DepthDetails US Patent