BDBM155720 US9012651, 153
SMILES OC[C@H](NCc1ccnc(n1)-c1ccc(cc1)C(F)(F)F)[C@@H](O)c1ccccc1
InChI Key InChIKey=VRORGYFXTLFXSL-OALUTQOASA-N
Data  1 IC50
  Tab Delimited (TSV)   2D SDfile   Computed 3D by Vconf -m prep SDfile
Find this compound or compounds like it in BindingDB:
Activity Spreadsheet -- Enzyme Inhibition Constant Data from BindingDB
Found 1 hit for monomerid = 155720
TargetTransient receptor potential cation channel subfamily V member 3(Homo sapiens (Human))
Abbvie
US Patent
LigandPNGBDBM155720(US9012651, 153)
Affinity DataIC50:  9.31E+3nM. Assay description: Experiments were conducted using the FLIPRTETRAŽ. On the day prior to the experiment, recombinant HEK293 cells that stably express human and mouse TR...
In DepthDetails US Patent