BDBM155881 US10118915, Compound C54::US9682966, C54
SMILES COC(=O)c1cc(Br)cnc1N1CCC(NC(=O)C2CCCCC2)C(O)C1
InChI Key InChIKey=CTAJMWYAAXDZSI-UHFFFAOYSA-N
Data  2 IC50
  Tab Delimited (TSV)   2D SDfile   Computed 3D by Vconf -m prep SDfile
Find this compound or compounds like it in BindingDB:
Activity Spreadsheet -- Enzyme Inhibition Constant Data from BindingDB
Found 2 hits for monomerid = 155881
TargetKappa-type opioid receptor(Homo sapiens (Human))
The Scripps Research Institute
US Patent
LigandPNGBDBM155881(US10118915, Compound C54 | US9682966, C54)
Affinity DataIC50: >2.00E+4nM. Assay description: Well-known assay for kappa opioid receptor
Ligand InfoPC cidPC sid
In DepthDetails US Patent
TargetKappa-type opioid receptor(Homo sapiens (Human))
The Scripps Research Institute
US Patent
LigandPNGBDBM155881(US10118915, Compound C54 | US9682966, C54)
Affinity DataIC50: >2.00E+4nMT: 2°C. Assay description: The cell line for the OPRK1 antagonist assay stably expresses the following elements. The carboxy terminus of the OPRK1 receptor has a 7 amino acid l...
Ligand InfoPC cidPC sid
In DepthDetails US Patent