BDBM156411 US9018381, 34::US9248140, 34
SMILES CNCC(=O)N[C@H](C1CCN(CC1)c1ccc(cc1)C(=O)NS(=O)(=O)c1ccc(N[C@H](CCN2CCOCC2)CSc2ccccc2)c(c1)S(=O)(=O)C(F)(F)F)c1ccccc1-c1ccc(Cl)cc1
InChI Key InChIKey=PVPORGAWYHFQGZ-OUDQIDCQSA-N
Data  4 IC50
  Tab Delimited (TSV)   2D SDfile   Computed 3D by Vconf -m prep SDfile
Find this compound or compounds like it in BindingDB:
Activity Spreadsheet -- Enzyme Inhibition Constant Data from BindingDB
Found 4 hits for monomerid = 156411
TargetBcl-2-like protein 1(Homo sapiens (Human))
Astrazeneca
US Patent
LigandPNGBDBM156411(US9018381, 34 | US9248140, 34)
Affinity DataIC50:  19nM. Assay description: Bcl-xL and Bcl-2 FP binding affinity of compound(s) of Formulae (I), (I-a), (I-b), (I-c), (I-d) and/or (I-e) may be determined using a variety of kno...
In DepthDetails US Patent
TargetApoptosis regulator Bcl-2 [1-204](Homo sapiens (Human))
Astrazeneca
US Patent
LigandPNGBDBM156411(US9018381, 34 | US9248140, 34)
Affinity DataIC50:  27nMpH: 7.5Assay Description:Bcl-xL and Bcl-2 FP binding affinity of compound(s) of Formulae (I), (I-a), (I-b), (I-c), (I-d) and/or (I-c) may be determined using a variety of kno...
In DepthDetails US Patent
TargetBcl-2-like protein 1 [1-209](Homo sapiens (Human))
Astrazeneca
US Patent
LigandPNGBDBM156411(US9018381, 34 | US9248140, 34)
Affinity DataIC50:  19nMpH: 7.5Assay Description:Bcl-xL and Bcl-2 FP binding affinity of compound(s) of Formulae (I), (I-a), (I-b), (I-c), (I-d) and/or (I-c) may be determined using a variety of kno...
In DepthDetails US Patent
TargetApoptosis regulator Bcl-2(Homo sapiens (Human))
Astrazeneca
US Patent
LigandPNGBDBM156411(US9018381, 34 | US9248140, 34)
Affinity DataIC50:  27nM. Assay description: Bcl-xL and Bcl-2 FP binding affinity of compound(s) of Formulae (I), (I-a), (I-b), (I-c), (I-d) and/or (I-e) may be determined using a variety of kno...
In DepthDetails US Patent