BDBM156721 US9029559, 137
SMILES Cc1ccc(cc1)-c1cccc(n1)C(=O)N[C@@H](CC(O)=O)c1ccccc1C
InChI Key InChIKey=COHUDWIXBJFWFD-NRFANRHFSA-N
Data  1 IC50
  Tab Delimited (TSV)   2D SDfile   Computed 3D by Vconf -m prep SDfile
Find this compound or compounds like it in BindingDB:
Activity Spreadsheet -- Enzyme Inhibition Constant Data from BindingDB
Found 1 hit for monomerid = 156721
TargetLysosomal protective protein(Homo sapiens (Human))
Sanofi
US Patent
LigandPNGBDBM156721(US9029559, 137)
Affinity DataIC50:  1.24E+3nMpH: 5.5 T: 2°C. Assay description: The activated cathepsin A was diluted in assay buffer (25 mM MES, pH 5.5, containing 5 mM DTT) and mixed with the test compound (dissolved in assay b...
In DepthDetails US Patent