BDBM156882 US9029559, 319
SMILES COc1cc(ccc1Cl)-c1nc(ccc1OC)C(=O)N[C@@H](CC(O)=O)c1ccccc1F
InChI Key InChIKey=CSOCAGXGPAPKSH-SFHVURJKSA-N
Data  1 IC50
  Tab Delimited (TSV)   2D SDfile   Computed 3D by Vconf -m prep SDfile
Find this compound or compounds like it in BindingDB:
Activity Spreadsheet -- Enzyme Inhibition Constant Data from BindingDB
Found 1 hit for monomerid = 156882
TargetLysosomal protective protein(Homo sapiens (Human))
Sanofi
US Patent
LigandPNGBDBM156882(US9029559, 319)
Affinity DataIC50: >1.00E+4nMpH: 5.5 T: 2°C. Assay description: The activated cathepsin A was diluted in assay buffer (25 mM MES, pH 5.5, containing 5 mM DTT) and mixed with the test compound (dissolved in assay b...
In DepthDetails US Patent