BDBM157107 US9029559, 587
SMILES OC(=O)C[C@H](NC(=O)c1cccc(n1)-c1ccccc1Cl)c1cccc(F)c1
InChI Key InChIKey=JYTTZIXGBAIORP-IBGZPJMESA-N
Data  1 IC50
  Tab Delimited (TSV)   2D SDfile   Computed 3D by Vconf -m prep SDfile
Find this compound or compounds like it in BindingDB:
Activity Spreadsheet -- Enzyme Inhibition Constant Data from BindingDB
Found 1 hit for monomerid = 157107
TargetLysosomal protective protein(Homo sapiens (Human))
Sanofi
US Patent
LigandPNGBDBM157107(US9029559, 587)
Affinity DataIC50:  7.35E+3nMpH: 5.5 T: 2°C. Assay description: The activated cathepsin A was diluted in assay buffer (25 mM MES, pH 5.5, containing 5 mM DTT) and mixed with the test compound (dissolved in assay b...
In DepthDetails US Patent