BDBM15747 2-(3-{[5-amino-1-(4-fluorophenyl)-1H-pyrazol-4-yl]carbonyl}phenyl)ethane-1-sulfonamide::5-Amino-4-[3-(2-aminosulfonylethyl) benzoyl]-1-(4-fluorophenyl)pyrazole::aminopyrazole 45
SMILES Nc1c(cnn1-c1ccc(F)cc1)C(=O)c1cccc(CCS(N)(=O)=O)c1
InChI Key InChIKey=PUBQBMIAESKDQT-UHFFFAOYSA-N
Data  1 IC50
  Tab Delimited (TSV)   2D SDfile   Computed 3D by Vconf -m prep SDfile
Find this compound or compounds like it in BindingDB:
Activity Spreadsheet -- Enzyme Inhibition Constant Data from BindingDB
Found 1 hit for monomerid = 15747
TargetMitogen-activated protein kinase 14(Homo sapiens (Human))
Roche Palo Alto
LigandPNGBDBM15747(2-(3-{[5-amino-1-(4-fluorophenyl)-1H-pyrazol-4-yl]...)
Affinity DataIC50:  1.25E+3nM. Assay description: Inhibition of human recombinant active p38alpha MAP kinase was tested by measuring the incorporation of 33P from gamma-[33P] ATP into myelin basic pr...
In DepthDetails ArticlePubMed