BDBM15752 2-(3-{[5-amino-1-(4-fluorophenyl)-1H-pyrazol-4-yl]carbonyl}phenyl)propane-1,2,3-triol::[5-Amino-1-(4-fluorophenyl)-1H-pyrazol-4-yl]-[3-(1,2-dihydroxy-1-hydroxymethylethyl)phenyl]methanone::aminopyrazole 58
SMILES Nc1c(cnn1-c1ccc(F)cc1)C(=O)c1cccc(c1)C(O)(CO)CO
InChI Key InChIKey=KQHTUTITZRQSRT-UHFFFAOYSA-N
Data  1 IC50
  Tab Delimited (TSV)   2D SDfile   Computed 3D by Vconf -m prep SDfile
Find this compound or compounds like it in BindingDB:
Activity Spreadsheet -- Enzyme Inhibition Constant Data from BindingDB
Found 1 hit for monomerid = 15752
TargetMitogen-activated protein kinase 14(Homo sapiens (Human))
Roche Palo Alto
LigandPNGBDBM15752(2-(3-{[5-amino-1-(4-fluorophenyl)-1H-pyrazol-4-yl]...)
Affinity DataIC50:  9.54E+3nM. Assay description: Inhibition of human recombinant active p38alpha MAP kinase was tested by measuring the incorporation of 33P from gamma-[33P] ATP into myelin basic pr...
In DepthDetails ArticlePubMed