BDBM15874 6-chloro-7-(dimethylamino)-9-hydroxy-1-methyl-3-(trifluoromethyl)-1H,4H,9H-pyrazolo[3,4-b]quinolin-4-one::9-hydroxy pyrazoloquinolinone 9d
SMILES CN(C)c1cc2n(O)c3n(C)nc(c3c(=O)c2cc1Cl)C(F)(F)F
InChI Key InChIKey=QQJKJYDGQYMYGX-UHFFFAOYSA-N
Data  1 IC50
  Tab Delimited (TSV)   2D SDfile   Computed 3D by Vconf -m prep SDfile
Find this compound or compounds like it in BindingDB:
Activity Spreadsheet -- Enzyme Inhibition Constant Data from BindingDB
Found 1 hit for monomerid = 15874
TargetMitogen-activated protein kinase 8(Homo sapiens (Human))
Abbott Laboratories
LigandPNGBDBM15874(6-chloro-7-(dimethylamino)-9-hydroxy-1-methyl-3-(t...)
Affinity DataIC50: >1.00E+4nMpH: 7.2 T: 2°C. Assay description: In vitro substrate phosphorylation using purified recombinant JNK, was incubated with substrate, and test compounds in the presence of 5uM ATP/ [gamm...
In DepthDetails ArticlePubMed