BDBM158752 US9034866, 227
SMILES CN1CCC(O)(C#Cc2ccc3OCCc4sc(nc4-c3c2)C(N)=O)C1=O
InChI Key InChIKey=GRTRHWLOIVWHQD-UHFFFAOYSA-N
Data  1 KI
  Tab Delimited (TSV)   2D SDfile   Computed 3D by Vconf -m prep SDfile
Find this compound or compounds like it in BindingDB:
Activity Spreadsheet -- Enzyme Inhibition Constant Data from BindingDB
Found 1 hit for monomerid = 158752
TargetMitogen-activated protein kinase kinase kinase 14(Homo sapiens (Human))
Genentech
US Patent
LigandPNGBDBM158752(US9034866, 227)
Affinity DataKi:  0.0400nMpH: 7.2Assay Description:The ability of the nuclear factor-kappa B (NF-kB)-inducing kinase (NIK) to catalyze the hydrolysis of adenosine-5'-triphosphate (ATP) was monitored u...
In DepthDetails US Patent