BDBM158893 US9034866, 368
SMILES CNC(=O)c1c(nc2-c3cc(C#CC4(O)CCC4)c(F)cc3C3CC(C3)n12)C(N)=O
InChI Key InChIKey=JFVKREBHCALAFX-UHFFFAOYSA-N
Data  1 KI
  Tab Delimited (TSV)   2D SDfile   Computed 3D by Vconf -m prep SDfile
Find this compound or compounds like it in BindingDB:
Activity Spreadsheet -- Enzyme Inhibition Constant Data from BindingDB
Found 1 hit for monomerid = 158893
TargetMitogen-activated protein kinase kinase kinase 14(Homo sapiens (Human))
Genentech
US Patent
LigandPNGBDBM158893(US9034866, 368)
Affinity DataKi:  0.400nMpH: 7.2Assay Description:The ability of the nuclear factor-kappa B (NF-kB)-inducing kinase (NIK) to catalyze the hydrolysis of adenosine-5'-triphosphate (ATP) was monitored u...
In DepthDetails US Patent