BDBM158910 US9034866, 385
SMILES Cc1cc(no1)[C@](C)(O)C#Cc1ccc2OCCc3nc(cn3-c2n1)C(N)=O
InChI Key InChIKey=XNDAOBGCXZWCFJ-LJQANCHMSA-N
Data  1 KI
  Tab Delimited (TSV)   2D SDfile   Computed 3D by Vconf -m prep SDfile
Find this compound or compounds like it in BindingDB:
Activity Spreadsheet -- Enzyme Inhibition Constant Data from BindingDB
Found 1 hit for monomerid = 158910
TargetMitogen-activated protein kinase kinase kinase 14(Homo sapiens (Human))
Genentech
US Patent
LigandPNGBDBM158910(US9034866, 385)
Affinity DataKi:  210nMpH: 7.2Assay Description:The ability of the nuclear factor-kappa B (NF-kB)-inducing kinase (NIK) to catalyze the hydrolysis of adenosine-5'-triphosphate (ATP) was monitored u...
In DepthDetails US Patent