BDBM159129 US10195186, Example 13::US9682967, 13
SMILES Cc1nccc(NC(=O)c2cc(Cl)c(Cl)cc2C(O)=O)n1
InChI Key InChIKey=LKWWQTHLSJUXMJ-UHFFFAOYSA-N
Data  2 KI  2 IC50
  Tab Delimited (TSV)   2D SDfile   Computed 3D by Vconf -m prep SDfile
Find this compound or compounds like it in BindingDB:
Activity Spreadsheet -- Enzyme Inhibition Constant Data from BindingDB
Found 3 hits for monomerid = 159129
TargetSortilin(Homo sapiens (Human))
H. Lundbeck
US Patent
LigandPNGBDBM159129(US10195186, Example 13 | US9682967, 13)
Affinity DataKi:  457nM IC50:  480nMpH: 7.4Assay Description:The Sortilin assay was performed in total volume of 40 ul in 50 mM HEPES pH 7.4 assay buffer containing 100 mM NaCl, 2.0 mM CaCl2, 0.1% BSA and 0.1% ...
Ligand InfoPC cidPC sid
In DepthDetails US Patent
TargetSortilin(Homo sapiens (Human))
H. Lundbeck
US Patent
LigandPNGBDBM159129(US10195186, Example 13 | US9682967, 13)
Affinity DataKi:  457nM. Assay description: The Sortilin assay was performed in total volume of 40 ul in 50 mM HEPES pH 7.4 assay buffer containing 100 mM NaCl, 2.0 mM CaCl2, 0.1% BSA and 0.1% ...
Ligand InfoPC cidPC sid
In DepthDetails US Patent
TargetSortilin(Homo sapiens (Human))
H. Lundbeck
US Patent
LigandPNGBDBM159129(US10195186, Example 13 | US9682967, 13)
Affinity DataIC50:  480nM. Assay description: The Sortilin assay was performed in total volume of 40 ul in 50 mM HEPES pH 7.4 assay buffer containing 100 mM NaCl, 2.0 mM CaCl2, 0.1% BSA and 0.1% ...
Ligand InfoPC cidPC sid
In DepthDetails US Patent