BDBM159182 US9034866, 659
SMILES Cc1cnc(o1)[C@@](C)(O)C#Cc1ccc2C3CC(C3)n3cc(nc3-c2c1)C(N)=O
InChI Key InChIKey=RODIOQSCTKCZKO-MRHLONDUSA-N
Data  4 KI
  Tab Delimited (TSV)   2D SDfile   Computed 3D by Vconf -m prep SDfile
Find this compound or compounds like it in BindingDB:
Activity Spreadsheet -- Enzyme Inhibition Constant Data from BindingDB
Found 4 hits for monomerid = 159182
TargetMitogen-activated protein kinase kinase kinase 14(Homo sapiens (Human))
Genentech
US Patent
LigandPNGBDBM159182(US9034866, 659)
Affinity DataKi:  0.290nMpH: 7.2Assay Description:The ability of the nuclear factor-kappa B (NF-kB)-inducing kinase (NIK) to catalyze the hydrolysis of adenosine-5'-triphosphate (ATP) was monitored u...
In DepthDetails US Patent
TargetSerine/threonine-protein kinase D1(Homo sapiens (Human))
Genentech
Curated by ChEMBL
LigandPNGBDBM159182(US9034866, 659)
Affinity DataKi:  4.20nM. Assay description: Inhibition of full length GST-tagged human PRKD1 expressed in Baculovirus expression system using ATP as substrate incubated for 1 to 2 hrs by transc...
In DepthDetails ArticlePubMed
TargetMitogen-activated protein kinase kinase kinase 14(Homo sapiens (Human))
Genentech
US Patent
LigandPNGBDBM159182(US9034866, 659)
Affinity DataKi: >1.25E+3nM. Assay description: Inhibition of NIK (unknown origin) using ATP as substrate by transcreener ADP assay based fluorescence correlation spectroscopic analysis
In DepthDetails ArticlePubMed
TargetMitogen-activated protein kinase kinase kinase 14(Homo sapiens (Human))
Genentech
US Patent
LigandPNGBDBM159182(US9034866, 659)
Affinity DataKi:  1.60E+3nMpH: 7.2Assay Description:The ability of the nuclear factor-kappa B (NF-kB)-inducing kinase (NIK) to catalyze the hydrolysis of adenosine-5'-triphosphate (ATP) was monitored u...
In DepthDetails US Patent