BDBM159298 US9034897, 14b
SMILES O[C@@H]1Cc2c(cc(F)cc2F)[C@H]1n1nc(c2CN(CCc12)C(=O)C1CC1)-c1cccc(c1)C#N
InChI Key InChIKey=FFZFTSOHIBYCIP-ILBGXUMGSA-N
Data  1 IC50
  Tab Delimited (TSV)   2D SDfile   Computed 3D by Vconf -m prep SDfile
Find this compound or compounds like it in BindingDB:
Activity Spreadsheet -- Enzyme Inhibition Constant Data from BindingDB
Found 1 hit for monomerid = 159298
TargetPotassium channel subfamily K member 3(Homo sapiens (Human))
Sanofi
US Patent
LigandPNGBDBM159298(US9034897, 14b)
Affinity DataIC50:  83.1nM. Assay description: Human TASK-1 channels were expressed in Xenopus oocytes. For this purpose, oocytes were isolated from Xenopus laevis and defoliculated. Subsequently,...
In DepthDetails US Patent