BDBM159328 US9034899, 10::US9604960, 10
SMILES CC1(C)NCC(c2ccc(Cl)c(Cl)c2)c2ccc(cc12)-c1ccc(nn1)C(F)(F)F
InChI Key InChIKey=MQRPDUHCJZKKNO-UHFFFAOYSA-N
Data  6 IC50
  Tab Delimited (TSV)   2D SDfile   Computed 3D by Vconf -m prep SDfile
Find this compound or compounds like it in BindingDB:
Activity Spreadsheet -- Enzyme Inhibition Constant Data from BindingDB
Found 6 hits for monomerid = 159328
TargetSodium-dependent serotonin transporter(Homo sapiens (Human))
Albany Molecular Research
US Patent
LigandPNGBDBM159328(US9034899, 10 | US9604960, 10)
Affinity DataIC50:  26nMpH: 7.5 T: 2°C. Assay description: Compounds were dissolved in 100% DMSO at a concentration 100 times the desired highest assay concentration, serially diluted 1:3 in 100% DMSO, and 0....
In DepthDetails US Patent
TargetSodium-dependent dopamine transporter(Homo sapiens (Human))
Albany Molecular Research
US Patent
LigandPNGBDBM159328(US9034899, 10 | US9604960, 10)
Affinity DataIC50:  28nMpH: 7.9 T: 2°C. Assay description: Compounds were dissolved in 100% DMSO at a concentration 100 times the desired highest assay concentration, serially diluted 1:3 in 100% DMSO, and 0....
In DepthDetails US Patent
TargetSodium-dependent noradrenaline transporter(Homo sapiens (Human))
Albany Molecular Research
US Patent
LigandPNGBDBM159328(US9034899, 10 | US9604960, 10)
Affinity DataIC50:  549nM. Assay description: Compounds were dissolved in 100% DMSO at a concentration 100 times the desired highest assay concentration, serially diluted 1:3 in 100% DMSO, and 1....
In DepthDetails US Patent
TargetSodium-dependent serotonin transporter(Homo sapiens (Human))
Albany Molecular Research
US Patent
LigandPNGBDBM159328(US9034899, 10 | US9604960, 10)
Affinity DataIC50:  26nM. Assay description: Compounds were dissolved in 100% DMSO at a concentration 100 times the desired highest assay concentration, serially diluted 1:3 in 100% DMSO, and 0....
In DepthDetails US Patent
TargetSodium-dependent dopamine transporter(Homo sapiens (Human))
Albany Molecular Research
US Patent
LigandPNGBDBM159328(US9034899, 10 | US9604960, 10)
Affinity DataIC50:  28nM. Assay description: Compounds were dissolved in 100% DMSO at a concentration 100 times the desired highest assay concentration, serially diluted 1:3 in 100% DMSO, and 0....
In DepthDetails US Patent
TargetSodium-dependent noradrenaline transporter(Homo sapiens (Human))
Albany Molecular Research
US Patent
LigandPNGBDBM159328(US9034899, 10 | US9604960, 10)
Affinity DataIC50:  549nMpH: 7.5 T: 2°C. Assay description: Compounds were dissolved in 100% DMSO at a concentration 100 times the desired highest assay concentration, serially diluted 1:3 in 100% DMSO, and 1....
In DepthDetails US Patent