BDBM159380 US9034907, 35
SMILES O=c1n(CCCn2ccnc2)c(=S)[nH]c2sc3CCCc3c12
InChI Key InChIKey=MSBHQHBFHGRWJF-UHFFFAOYSA-N
Data  1 KI  1 IC50
  Tab Delimited (TSV)   2D SDfile   Computed 3D by Vconf -m prep SDfile
Find this compound or compounds like it in BindingDB:
Activity Spreadsheet -- Enzyme Inhibition Constant Data from BindingDB
Found 1 hit for monomerid = 159380
TargetGlutaminyl-peptide cyclotransferase(Homo sapiens (Human))
Probiodrug
US Patent
LigandPNGBDBM159380(US9034907, 35)
Affinity DataKi:  615nM ΔG°:  -8.61kcal/mole IC50:  5.85E+3nMpH: 8.0 T: 2°C. Assay description: Fluorometric Assays: All measurements were performed with a BioAssay Reader HTS-7000Plus for microplates (Perkin Elmer) at 30 C. QC activity was eval...
In DepthDetails US Patent