BDBM15943 1-(4-Amino-5-cyano-6-ethoxypyridin-2-yl)-3-ethylurea::Aminopyridine-Based Inhibitor 8
SMILES CCNC(=O)Nc1cc(N)c(C#N)c(OCC)n1
InChI Key InChIKey=BUHUUNCDPICPOE-UHFFFAOYSA-N
Data  2 IC50
  Tab Delimited (TSV)   2D SDfile   Computed 3D by Vconf -m prep SDfile
Find this compound or compounds like it in BindingDB:
Activity Spreadsheet -- Enzyme Inhibition Constant Data from BindingDB
Found 2 hits for monomerid = 15943
TargetMitogen-activated protein kinase 9(Homo sapiens (Human))
Abbott Laboratories
LigandPNGBDBM15943(1-(4-Amino-5-cyano-6-ethoxypyridin-2-yl)-3-ethylur...)
Affinity DataIC50: >1.00E+4nM. Assay description: In vitro substrate phosphorylation using purified recombinant JNK, was incubated with substrate, and test compounds in the presence of 5uM ATP/ [gamm...
Ligand InfoPC cidPC sid
In DepthDetails ArticlePubMed
TargetMitogen-activated protein kinase 8(Homo sapiens (Human))
Abbott Laboratories
LigandPNGBDBM15943(1-(4-Amino-5-cyano-6-ethoxypyridin-2-yl)-3-ethylur...)
Affinity DataIC50: >1.00E+4nM. Assay description: In vitro substrate phosphorylation using purified recombinant JNK, was incubated with substrate, and test compounds in the presence of 5uM ATP/ [gamm...
Ligand InfoPC cidPC sid
In DepthDetails ArticlePubMed