BDBM15956 Aminopyridine-Based Inhibitor 18b::N-(4-Amino-5-cyano-6-isopropoxypyridin-2-yl)-2-(4-methanesulfonyl-2,5-dimethoxyphenyl)acetamide::N-[4-amino-5-cyano-6-(propan-2-yloxy)pyridin-2-yl]-2-(4-methanesulfonyl-2,5-dimethoxyphenyl)acetamide
SMILES COc1cc(c(OC)cc1CC(=O)Nc1cc(N)c(C#N)c(OC(C)C)n1)S(C)(=O)=O
InChI Key InChIKey=CSDDCHPGQGWRLI-UHFFFAOYSA-N
Data  3 KI  2 IC50
  Tab Delimited (TSV)   2D SDfile   Computed 3D by Vconf -m prep SDfile
Find this compound or compounds like it in BindingDB:
Activity Spreadsheet -- Enzyme Inhibition Constant Data from BindingDB
Found 5 hits for monomerid = 15956
TargetMitogen-activated protein kinase 8(Homo sapiens (Human))
Abbott Laboratories
LigandPNGBDBM15956(Aminopyridine-Based Inhibitor 18b | N-(4-Amino-5-c...)
Affinity DataKi:  1nM. Assay description: Ser/Thr-kinase selectivity assays were performed using a radioactive FlashPlate-based assay platform. Substrate incorporated radioactivity was counte...
In DepthDetails ArticlePubMed
TargetMitogen-activated protein kinase 9(Homo sapiens (Human))
Abbott Laboratories
LigandPNGBDBM15956(Aminopyridine-Based Inhibitor 18b | N-(4-Amino-5-c...)
Affinity DataKi:  4nM. Assay description: Ser/Thr-kinase selectivity assays were performed using a radioactive FlashPlate-based assay platform. Substrate incorporated radioactivity was counte...
In DepthDetails ArticlePubMed
TargetMitogen-activated protein kinase 10(Homo sapiens (Human))
Abbott Laboratories
LigandPNGBDBM15956(Aminopyridine-Based Inhibitor 18b | N-(4-Amino-5-c...)
Affinity DataKi:  18nM. Assay description: Ser/Thr-kinase selectivity assays were performed using a radioactive FlashPlate-based assay platform. Substrate incorporated radioactivity was counte...
In DepthDetails ArticlePubMed
TargetMitogen-activated protein kinase 9(Homo sapiens (Human))
Abbott Laboratories
LigandPNGBDBM15956(Aminopyridine-Based Inhibitor 18b | N-(4-Amino-5-c...)
Affinity DataIC50:  64nM. Assay description: In vitro substrate phosphorylation using purified recombinant JNK, was incubated with substrate, and test compounds in the presence of 5uM ATP/ [gamm...
In DepthDetails ArticlePubMed
TargetMitogen-activated protein kinase 8(Homo sapiens (Human))
Abbott Laboratories
LigandPNGBDBM15956(Aminopyridine-Based Inhibitor 18b | N-(4-Amino-5-c...)
Affinity DataIC50:  14nM. Assay description: In vitro substrate phosphorylation using purified recombinant JNK, was incubated with substrate, and test compounds in the presence of 5uM ATP/ [gamm...
In DepthDetails ArticlePubMed