BDBM159600 US8772490, Example 23::US9035062, 23
SMILES NC(=O)[C@@H]1CC[C@@H]2CN1C(=O)N2OS(=O)(=O)O[Na]
InChI Key InChIKey=RTCIKUMODPANKX-JBUOLDKXSA-M
Data  2 IC50
  Tab Delimited (TSV)   2D SDfile   Computed 3D by Vconf -m prep SDfile
Find this compound or compounds like it in BindingDB:
Activity Spreadsheet -- Enzyme Inhibition Constant Data from BindingDB
Found 2 hits for monomerid = 159600
TargetBeta-lactamase(Pseudomonas aeruginosa (PAO1))
Meiji Seika Pharma
US Patent
LigandPNGBDBM159600(US8772490, Example 23 | US9035062, 23)
Affinity DataIC50:  650nMpH: 7.0 T: 2°C. Assay description: For the measurement of β-lactamase inhibitory activity, 100 uM (final concentration) nitrocefin (Oxoid) was used as a substrate, and 2.5% DMSO, ...
In DepthDetails US Patent
TargetBeta-lactamase(Escherichia coli)
Meiji Seika Pharma
US Patent
LigandPNGBDBM159600(US8772490, Example 23 | US9035062, 23)
Affinity DataIC50:  650nMpH: 7.0Assay Description:For the measurement of β-lactamase inhibitory activity, 100 μM (final concentration) nitrocefin (Oxoid) was used as a substrate, and 2.5% D...
In DepthDetails US Patent