BDBM159695 US9035059, 14-18
SMILES CCCCCOc1ccc(NS(=O)(=O)c2ccc3CN(Cc3c2)C(=O)Nc2ccc(cc2)C(C)(C)C)c(F)c1
InChI Key InChIKey=HCLVCLSUVTYAOF-UHFFFAOYSA-N
Data  2 IC50
  Tab Delimited (TSV)   2D SDfile   Computed 3D by Vconf -m prep SDfile
Find this compound or compounds like it in BindingDB:
Activity Spreadsheet -- Enzyme Inhibition Constant Data from BindingDB
Found 2 hits for monomerid = 159695
Target2-acylglycerol O-acyltransferase 2(Homo sapiens (Human))
Taisho Pharmaceutical
Curated by ChEMBL
LigandPNGBDBM159695(US9035059, 14-18)
Affinity DataIC50:  147nM. Assay description: Inhibition of human recombinant MGAT2 assessed as reduction in enzyme-mediated deacylation of oleoyl-CoA incubated for 20 mins by CPM dye based fluor...
In DepthDetails ArticlePubMed
Target2-acylglycerol O-acyltransferase 2(Homo sapiens (Human))
Taisho Pharmaceutical
Curated by ChEMBL
LigandPNGBDBM159695(US9035059, 14-18)
Affinity DataIC50:  147nM. Assay description: A test for MGAT2 inhibitory action of test compounds was conducted in accordance with a partially modified version of the method described in John F....
In DepthDetails US Patent