BDBM15984 2-{[2-(cyclohexylmethoxy)pyrimidin-4-yl]amino}benzoic acid::4-anilinopyrimidine 6f
SMILES OC(=O)c1ccccc1Nc1ccnc(OCC2CCCCC2)n1
InChI Key InChIKey=AJFJKESCIZJWIX-UHFFFAOYSA-N
Data  1 IC50
  Tab Delimited (TSV)   2D SDfile   Computed 3D by Vconf -m prep SDfile
Find this compound or compounds like it in BindingDB:
Activity Spreadsheet -- Enzyme Inhibition Constant Data from BindingDB
Found 1 hit for monomerid = 15984
TargetMitogen-activated protein kinase 8(Homo sapiens (Human))
Abbott Laboratories
LigandPNGBDBM15984(2-{[2-(cyclohexylmethoxy)pyrimidin-4-yl]amino}benz...)
Affinity DataIC50:  700nMpH: 7.2 T: 2°C. Assay description: In vitro substrate phosphorylation using purified recombinant JNK, was incubated with substrate, and test compounds in the presence of 5uM ATP/ [gamm...
In DepthDetails ArticlePubMed