BDBM159893 US9040528, 49
SMILES COCc1noc2c(Cl)c3N4C[C@@H](C)O[C@@H](C)[C@@H]4C4(Cc3cc12)C(=O)NC(=O)NC4=O
InChI Key InChIKey=CSSYQBTWFZMHJG-YNEJBJPTSA-N
Data  1 IC50
  Tab Delimited (TSV)   2D SDfile   Computed 3D by Vconf -m prep SDfile
Find this compound or compounds like it in BindingDB:
Activity Spreadsheet -- Enzyme Inhibition Constant Data from BindingDB
Found 1 hit for monomerid = 159893
TargetDNA gyrase subunit A/B(Escherichia coli (strain K12))
Astrazeneca
US Patent
LigandPNGBDBM159893(US9040528, 49)
Affinity DataIC50:  1.70E+3nMpH: 7.5Assay Description:In a black, 384-well polystyrene assay plate, 30 microliters/well of 5 nM Escherichia coli DNA gyrase A/B tetramer and 130 micrograms/ml of topologic...
In DepthDetails US Patent