BDBM160048 US9040528, 181
SMILES C[C@@H]1CN2[C@H]([C@H](C)O1)C1(Cc3cc4c(noc4c(F)c23)S(C)=O)C(=O)NC(=O)NC1=O
InChI Key InChIKey=XKCVSPQEFVJYLX-BOAYWSRFSA-N
Data  1 IC50
  Tab Delimited (TSV)   2D SDfile   Computed 3D by Vconf -m prep SDfile
Find this compound or compounds like it in BindingDB:
Activity Spreadsheet -- Enzyme Inhibition Constant Data from BindingDB
Found 1 hit for monomerid = 160048
TargetDNA gyrase subunit A/B(Escherichia coli (strain K12))
Astrazeneca
US Patent
LigandPNGBDBM160048(US9040528, 181)
Affinity DataIC50:  3.30E+3nMpH: 7.5Assay Description:In a black, 384-well polystyrene assay plate, 30 microliters/well of 5 nM Escherichia coli DNA gyrase A/B tetramer and 130 micrograms/ml of topologic...
In DepthDetails US Patent