BDBM16007 2-{[2-(1H-indazol-5-ylamino)pyrimidin-4-yl]amino}benzoic acid::4-anilinopyrimidine 15b
SMILES OC(=O)c1ccccc1Nc1ccnc(Nc2ccc3[nH]ncc3c2)n1
InChI Key InChIKey=GCBJDOWIQHMCMR-UHFFFAOYSA-N
Data  1 IC50
  Tab Delimited (TSV)   2D SDfile   Computed 3D by Vconf -m prep SDfile
Find this compound or compounds like it in BindingDB:
Activity Spreadsheet -- Enzyme Inhibition Constant Data from BindingDB
Found 1 hit for monomerid = 16007
TargetMitogen-activated protein kinase 8(Homo sapiens (Human))
Abbott Laboratories
LigandPNGBDBM16007(2-{[2-(1H-indazol-5-ylamino)pyrimidin-4-yl]amino}b...)
Affinity DataIC50:  55nM. Assay description: In vitro substrate phosphorylation using purified recombinant JNK, was incubated with substrate, and test compounds in the presence of 5uM ATP/ [gamm...
In DepthDetails ArticlePubMed