BDBM160291 US9040691, 19
SMILES Nc1ncnn2c(CN3CCOCC3)cc(-c3ccc(CO)cc3)c12
InChI Key InChIKey=GFPNHNZUEXUZSR-UHFFFAOYSA-N
Data  1 IC50
  Tab Delimited (TSV)   2D SDfile   Computed 3D by Vconf -m prep SDfile
Find this compound or compounds like it in BindingDB:
Activity Spreadsheet -- Enzyme Inhibition Constant Data from BindingDB
Found 1 hit for monomerid = 160291
TargetSerine/threonine-protein kinase receptor R3(Homo sapiens (Human))
Bayer Intellectual Property
US Patent
LigandPNGBDBM160291(US9040691, 19)
Affinity DataIC50:  19nM. Assay description: In vitro enzyme inhibition using scintillation of incorporated radio label (flashplate assay). Test compounds diluted in DMSO are mixed with a suitab...
In DepthDetails US Patent