BDBM160312 US9040691, 40::US9040691, 41::US9040691, 42
SMILES COc1cc(ccc1CO)-c1cc(C(O)C2CC2)n2ncnc(N)c12
InChI Key InChIKey=CETAVAHOOHFRIY-UHFFFAOYSA-N
Data  3 IC50
  Tab Delimited (TSV)   2D SDfile   Computed 3D by Vconf -m prep SDfile
Find this compound or compounds like it in BindingDB:
Activity Spreadsheet -- Enzyme Inhibition Constant Data from BindingDB
Found 3 hits for monomerid = 160312
TargetSerine/threonine-protein kinase receptor R3(Homo sapiens (Human))
Bayer Intellectual Property
US Patent
LigandPNGBDBM160312(US9040691, 40 | US9040691, 41 | US9040691, 42)
Affinity DataIC50:  3.20nM. Assay description: In vitro enzyme inhibition using scintillation of incorporated radio label (flashplate assay). Test compounds diluted in DMSO are mixed with a suitab...
In DepthDetails US Patent
TargetSerine/threonine-protein kinase receptor R3(Homo sapiens (Human))
Bayer Intellectual Property
US Patent
LigandPNGBDBM160312(US9040691, 40 | US9040691, 41 | US9040691, 42)
Affinity DataIC50:  1.20nM. Assay description: In vitro enzyme inhibition using scintillation of incorporated radio label (flashplate assay). Test compounds diluted in DMSO are mixed with a suitab...
In DepthDetails US Patent
TargetSerine/threonine-protein kinase receptor R3(Homo sapiens (Human))
Bayer Intellectual Property
US Patent
LigandPNGBDBM160312(US9040691, 40 | US9040691, 41 | US9040691, 42)
Affinity DataIC50:  3.5nM. Assay description: In vitro enzyme inhibition using scintillation of incorporated radio label (flashplate assay). Test compounds diluted in DMSO are mixed with a suitab...
In DepthDetails US Patent