BDBM16053 (2S)-2-{[(1R,2R)-2-[(1S,2S)-2-[(2S)-2-[(2S)-2-acetamido-4-methylpentanamido]-4-(methylsulfanyl)butanamido]-1-hydroxy-4-methylpentyl]cyclopentyl]formamido}-3-methylbutanoic acid::N-acetyl-L-leucyl-N-{(1S)-1-[(S)-[(1R,2R)-2-{[(1S)-1-carboxy-2-methylpropyl]carbamoyl}cyclopentyl](hydroxy)methyl]-3-methylbutyl}-L-methioninamide::truncated OM99-2 cyclopentano analog 40
SMILES [H][C@]1(CCC[C@H]1C(=O)N[C@@H](C(C)C)C(O)=O)[C@H](O)[C@H](CC(C)C)NC(=O)[C@H](CCSC)NC(=O)[C@H](CC(C)C)NC(C)=O
InChI Key InChIKey=CNPSOKHTVYNFTA-XRVGGGAJSA-N
Data  2 IC50
  Tab Delimited (TSV)   2D SDfile   Computed 3D by Vconf -m prep SDfile
Find this compound or compounds like it in BindingDB:
Activity Spreadsheet -- Enzyme Inhibition Constant Data from BindingDB
Found 2 hits for monomerid = 16053
TargetCathepsin D(Homo sapiens (Human))
Universite De Montreal At Succursale Centre-Ville
LigandPNGBDBM16053((2S)-2-{[(1R,2R)-2-[(1S,2S)-2-[(2S)-2-[(2S)-2-acet...)
Affinity DataIC50:  25nMT: 2°C. Assay description: Inhibition assays were done in black 96-well plates by adding test compounds to the respective enzyme in assay buffer. Plates were incubated at room ...
In DepthDetails ArticlePubMed
TargetBeta-secretase 1 [1-453](Homo sapiens (Human))
Universite De Montreal At Succursale Centre-Ville
LigandPNGBDBM16053((2S)-2-{[(1R,2R)-2-[(1S,2S)-2-[(2S)-2-[(2S)-2-acet...)
Affinity DataIC50:  190nMpH: 4.5 T: 2°C. Assay description: Inhibition assays were done in black 96-well plates by adding test compounds to the respective enzyme in assay buffer. Plates were incubated at room ...
In DepthDetails ArticlePubMed