BDBM160548 US9682971, 2
SMILES OC(=O)[C@@H]1CCCC[C@H]1c1nc2cc(OCc3ccc4ccccc4n3)ccc2n1Cc1ccc(Br)cc1
InChI Key InChIKey=SBLFULGYUXMXLD-CLJLJLNGSA-N
Data  1 KI
  Tab Delimited (TSV)   2D SDfile   Computed 3D by Vconf -m prep SDfile
Find this compound or compounds like it in BindingDB:
Activity Spreadsheet -- Enzyme Inhibition Constant Data from BindingDB
Found 1 hit for monomerid = 160548
TargetArachidonate 5-lipoxygenase-activating protein(Homo sapiens (Human))
Janssen Pharmaceutica
US Patent
LigandPNGBDBM160548(US9682971, 2)
Affinity DataKi:  510nM. Assay description: The assay below is used to test the modulatory activity of compounds against FLAP. Human and mouse FLAP-encoding DNA was amplified by polymerase chai...
Ligand InfoPC cidPC sid
In DepthDetails US Patent