BDBM160813 US10167313, Compound 82::US9045524, 82
SMILES CC(C)[C@H](NC(=O)[C@H](CCC(O)=O)NC(=O)[C@H](Cc1ccc(O)cc1)NC(=O)OCc1ccccc1)C(=O)N[C@@H](CC(O)=O)\C=C\S(C)(=O)=O
InChI Key InChIKey=CEFXQYILQBZDCM-JNINCFPBSA-N
Data  10 IC50
  Tab Delimited (TSV)   2D SDfile   Computed 3D by Vconf -m prep SDfile
Find this compound or compounds like it in BindingDB:
Activity Spreadsheet -- Enzyme Inhibition Constant Data from BindingDB
Found 10 hits for monomerid = 160813
TargetCaspase-1(Homo sapiens (Human))
Novagenesis Foundation
US Patent
LigandPNGBDBM160813(US10167313, Compound 82 | US9045524, 82)
Affinity DataIC50:  500nMT: 2°C. Assay description: Selectivity of compound 55, compound 63, compound 48, compound 57, compound 88 toward caspase-1 (pro-inflammatory group), caspase-5 (group I), caspas...
In DepthDetails US Patent
TargetCaspase-5(Homo sapiens (Human))
Novagenesis Foundation
US Patent
LigandPNGBDBM160813(US10167313, Compound 82 | US9045524, 82)
Affinity DataIC50: >3.00E+3nMT: 2°C. Assay description: Selectivity of compound 55, compound 63, compound 48, compound 57, compound 88 toward caspase-1 (pro-inflammatory group), caspase-5 (group I), caspas...
In DepthDetails US Patent
TargetCaspase-7(Homo sapiens (Human))
Novagenesis Foundation
US Patent
LigandPNGBDBM160813(US10167313, Compound 82 | US9045524, 82)
Affinity DataIC50: >5.00E+3nMT: 2°C. Assay description: Selectivity of compound 55, compound 63, compound 48, compound 57, compound 88 toward caspase-1 (pro-inflammatory group), caspase-5 (group I), caspas...
In DepthDetails US Patent
TargetCaspase-9(Homo sapiens (Human))
Novagenesis Foundation
US Patent
LigandPNGBDBM160813(US10167313, Compound 82 | US9045524, 82)
Affinity DataIC50:  1.60E+3nMT: 2°C. Assay description: Selectivity of compound 55, compound 63, compound 48, compound 57, compound 88 toward caspase-1 (pro-inflammatory group), caspase-5 (group I), caspas...
In DepthDetails US Patent
TargetCaspase-9(Homo sapiens (Human))
Novagenesis Foundation
US Patent
LigandPNGBDBM160813(US10167313, Compound 82 | US9045524, 82)
Affinity DataIC50:  1.60E+3nM. Assay description: Selectivity of compound 55, compound 63, compound 48, compound 57, compound 88 toward caspase-1 (pro-inflammatory group), caspase-5 (group I), caspas...
In DepthDetails US Patent
TargetCaspase-1(Homo sapiens (Human))
Novagenesis Foundation
US Patent
LigandPNGBDBM160813(US10167313, Compound 82 | US9045524, 82)
Affinity DataIC50:  500nM. Assay description: Selectivity of compound 55, compound 63, compound 48, compound 57, compound 88 toward caspase-1 (pro-inflammatory group), caspase-5 (group I), caspas...
In DepthDetails US Patent
TargetCaspase-3(Homo sapiens (Human))
Genesis Technologies
US Patent
LigandPNGBDBM160813(US10167313, Compound 82 | US9045524, 82)
Affinity DataIC50:  300nM. Assay description: Selectivity of compound 55, compound 63, compound 48, compound 57, compound 88 toward caspase-1 (pro-inflammatory group), caspase-5 (group I), caspas...
In DepthDetails US Patent
TargetCaspase-5(Homo sapiens (Human))
Novagenesis Foundation
US Patent
LigandPNGBDBM160813(US10167313, Compound 82 | US9045524, 82)
Affinity DataIC50: >3.00E+3nM. Assay description: Selectivity of compound 55, compound 63, compound 48, compound 57, compound 88 toward caspase-1 (pro-inflammatory group), caspase-5 (group I), caspas...
In DepthDetails US Patent
TargetCaspase-7(Homo sapiens (Human))
Novagenesis Foundation
US Patent
LigandPNGBDBM160813(US10167313, Compound 82 | US9045524, 82)
Affinity DataIC50: >5.00E+3nM. Assay description: Selectivity of compound 55, compound 63, compound 48, compound 57, compound 88 toward caspase-1 (pro-inflammatory group), caspase-5 (group I), caspas...
In DepthDetails US Patent
TargetCaspase-3(Homo sapiens (Human))
Genesis Technologies
US Patent
LigandPNGBDBM160813(US10167313, Compound 82 | US9045524, 82)
Affinity DataIC50:  300nM. Assay description: To test the efficacy of caspase-3 inhibitors at the cellular level, the ability of selected compounds to inhibit the proteolytic cleavage of PARP (po...
In DepthDetails US Patent