BDBM161208 US9051265, 116
SMILES C[C@H](Oc1cc(Cn2c(C)c(C)c3cc(ccc23)C(=O)N[C@@H](C)c2cccc(c2)C2CC2)ccc1F)C(O)=O
InChI Key InChIKey=JFOOVABXXMXZLB-FPOVZHCZSA-N
Data  1 IC50
  Tab Delimited (TSV)   2D SDfile   Computed 3D by Vconf -m prep SDfile
Find this compound or compounds like it in BindingDB:
Activity Spreadsheet -- Enzyme Inhibition Constant Data from BindingDB
Found 1 hit for monomerid = 161208
TargetPeroxisome proliferator-activated receptor gamma(Homo sapiens (Human))
The Scripps Research Institute
US Patent
LigandPNGBDBM161208(US9051265, 116)
Affinity DataIC50:  20nM. Assay description: The assay was performed according to manufacturer protocol. A mixture of 5 nM GST-PPARG-LBD, 5 nM Tb-GST-antibody, 5 nM Fluormone Pan- PPAR Green, an...
In DepthDetails US Patent