BDBM16121 4-({2,6-difluoro-4-[3-(trifluoromethoxy)phenyl]phenyl}carbamoyl)thiophene-3-carboxylic acid::Biphenyl-4-ylcarbamoyl Thiophene Analog 12
SMILES OC(=O)c1cscc1C(=O)Nc1c(F)cc(cc1F)-c1cccc(OC(F)(F)F)c1
InChI Key InChIKey=SQLICQPGFRKORR-UHFFFAOYSA-N
Data  1 IC50
  Tab Delimited (TSV)   2D SDfile   Computed 3D by Vconf -m prep SDfile
Find this compound or compounds like it in BindingDB:
Activity Spreadsheet -- Enzyme Inhibition Constant Data from BindingDB
Found 1 hit for monomerid = 16121
LigandPNGBDBM16121(4-({2,6-difluoro-4-[3-(trifluoromethoxy)phenyl]phe...)
Affinity DataIC50:  10nMpH: 8.0 T: 2°C. Assay description: The assays were carried out by using a colorimetric DCIP method, which uses the colorimetric reagent 2, 6-dichlorophenolindophenol as the final elect...
In DepthDetails ArticlePubMed