BDBM161366 US10087143, Compound 151::US10738009, Compound 151::US11673864, Compound 151::US9051270, 151::US9758483, Compound 151
SMILES Cc1ncccc1Oc1ccc(OC(F)(F)F)cc1C(=O)Nc1cc[nH]c(=O)c1
InChI Key InChIKey=QULMOQQNFDJHJA-UHFFFAOYSA-N
Data  5 IC50
  Tab Delimited (TSV)   2D SDfile   Computed 3D by Vconf -m prep SDfile
Find this compound or compounds like it in BindingDB:
Activity Spreadsheet -- Enzyme Inhibition Constant Data from BindingDB
Found 5 hits for monomerid = 161366
TargetSodium channel protein type 10 subunit alpha(Rattus norvegicus (Rat))
Vertex Pharmaceuticals
US Patent
LigandPNGBDBM161366(US10087143, Compound 151 | US10738009, Compound 15...)
Affinity DataIC50:  8.40E+3nM. Assay description: Patch clamp electrophysiology was used to assess the efficacy and selectivity of sodium channel blockers in dorsal root ganglion neurons. Rat neurons...
In DepthDetails US Patent
TargetSodium channel protein type 10 subunit alpha(Homo sapiens (Human))
Vertex Pharmaceuticals
US Patent
LigandPNGBDBM161366(US10087143, Compound 151 | US10738009, Compound 15...)
Affinity DataIC50:  8.40E+3nM. Assay description: Sodium channels are voltage-dependent proteins that can be activated by inducing membrane voltage changes by applying electric fields. The electrical...
In DepthDetails US Patent
TargetSodium channel protein type 8 subunit alpha(Homo sapiens (Human))
Vertex Pharmaceuticals
US Patent
LigandPNGBDBM161366(US10087143, Compound 151 | US10738009, Compound 15...)
Affinity DataIC50:  8.40E+3nM. Assay description: 1) Pre-spotted compounds (in neat DMSO) into compound plates. Vehicle control (neat DMSO), the positive control (20 mM DMSO stock tetracaine, 125 ...
In DepthDetails US Patent
TargetSodium channel protein type 10 subunit alpha(Homo sapiens (Human))
Vertex Pharmaceuticals
US Patent
LigandPNGBDBM161366(US10087143, Compound 151 | US10738009, Compound 15...)
Affinity DataIC50:  8.40E+3nM. Assay description: Patch clamp electrophysiology was used to assess the efficacy and selectivity of sodium channel blockers in dorsal root ganglion neurons. Rat neurons...
In DepthDetails US Patent
TargetSodium channel protein type 10 subunit alpha(Homo sapiens (Human))
Vertex Pharmaceuticals
US Patent
LigandPNGBDBM161366(US10087143, Compound 151 | US10738009, Compound 15...)
Affinity DataIC50:  8.40E+3nM. Assay description: 1) Pre-spotted compounds (in neat DMSO) into compound plates. Vehicle control (neat DMSO), the positive control (20 mM DMSO stock tetracaine, 125 ...
In DepthDetails US Patent