BDBM161686 US9051279, 4
SMILES CC[C@@H](C)Oc1cc2C(N(C(=O)Cc2cc1OC)c1ccc(cc1)N(C)C)c1ccc(Cl)cc1NC(=O)NC
InChI Key InChIKey=MEMPXHHRCPTSPQ-QHSQBYJISA-N
Data  1 IC50
  Tab Delimited (TSV)   2D SDfile   Computed 3D by Vconf -m prep SDfile
Find this compound or compounds like it in BindingDB:
Activity Spreadsheet -- Enzyme Inhibition Constant Data from BindingDB
Found 1 hit for monomerid = 161686
TargetE3 ubiquitin-protein ligase Mdm2(Homo sapiens (Human))
Novartis
US Patent
LigandPNGBDBM161686(US9051279, 4)
Affinity DataIC50:  7.12E+4nM. Assay description: The inhibition of p53-Hdm2 and p53-Hdm4 interactions is measured by time resolved fluorescence energy transfer (TR-FRET). Fluorescence energy transfe...
In DepthDetails US Patent