BDBM161932 US10017516, Compound 64::US9682983, 64
SMILES Cc1ccc2c(cccc2n1)-c1cnn2cc(cnc12)-c1ccc(O[C@@H]2CCNC2)cn1
InChI Key InChIKey=SQRAKIQIMGAALF-LJQANCHMSA-N
Data  8 IC50
  Tab Delimited (TSV)   2D SDfile   Computed 3D by Vconf -m prep SDfile
Find this compound or compounds like it in BindingDB:
Activity Spreadsheet -- Enzyme Inhibition Constant Data from BindingDB
Found 8 hits for monomerid = 161932
TargetSerine/threonine-protein kinase receptor R3(Homo sapiens (Human))
The Brigham And Women'S Hospital
US Patent
LigandPNGBDBM161932(US10017516, Compound 64 | US9682983, 64)
Affinity DataIC50:  1.35E+3nMpH: 7.5Assay Description:Specifically, compounds were assayed using LANCE® Ultra ULight¿ technology (Perkin Elmer) against human ALK1-6 enzymes (ALK1: Life Technologies, ALK2...
Ligand InfoPC cidPC sid
In DepthDetails US Patent
TargetActivin receptor type-1(Homo sapiens (Human))
The Brigham And Women'S Hospital
US Patent
LigandPNGBDBM161932(US10017516, Compound 64 | US9682983, 64)
Affinity DataIC50:  276nMpH: 7.5Assay Description:Specifically, compounds were assayed using LANCE® Ultra ULight¿ technology (Perkin Elmer) against human ALK1-6 enzymes (ALK1: Life Technologies, ALK2...
Ligand InfoPC cidPC sid
In DepthDetails US Patent
TargetActivin receptor type-1B(Homo sapiens (Human))
The Brigham And Women'S Hospital
US Patent
LigandPNGBDBM161932(US10017516, Compound 64 | US9682983, 64)
Affinity DataIC50:  4.64E+4nMpH: 7.5Assay Description:Specifically, compounds were assayed using LANCE® Ultra ULight¿ technology (Perkin Elmer) against human ALK1-6 enzymes (ALK1: Life Technologies, ALK2...
Ligand InfoPC cidPC sid
In DepthDetails US Patent
TargetBone morphogenetic protein receptor type-1B(Homo sapiens (Human))
The Brigham And Women'S Hospital
US Patent
LigandPNGBDBM161932(US10017516, Compound 64 | US9682983, 64)
Affinity DataIC50:  6.41E+3nM. Assay description: Compounds were assessed in ALK1-6 enzymatic assays. Specifically, compounds were assayed using LANCE® Ultra ULight technology (Perkin Elmer) against ...
Ligand InfoPC cidPC sid
In DepthDetails US Patent
TargetSerine/threonine-protein kinase receptor R3(Homo sapiens (Human))
The Brigham And Women'S Hospital
US Patent
LigandPNGBDBM161932(US10017516, Compound 64 | US9682983, 64)
Affinity DataIC50:  1.35E+3nM. Assay description: Compounds were assessed in ALK1-6 enzymatic assays. Specifically, compounds were assayed using LANCE® Ultra ULight technology (Perkin Elmer) against ...
Ligand InfoPC cidPC sid
In DepthDetails US Patent
TargetActivin receptor type-1(Homo sapiens (Human))
The Brigham And Women'S Hospital
US Patent
LigandPNGBDBM161932(US10017516, Compound 64 | US9682983, 64)
Affinity DataIC50:  276nM. Assay description: Compounds were assessed in ALK1-6 enzymatic assays. Specifically, compounds were assayed using LANCE® Ultra ULight technology (Perkin Elmer) against ...
Ligand InfoPC cidPC sid
In DepthDetails US Patent
TargetActivin receptor type-1B(Homo sapiens (Human))
The Brigham And Women'S Hospital
US Patent
LigandPNGBDBM161932(US10017516, Compound 64 | US9682983, 64)
Affinity DataIC50:  4.64E+4nM. Assay description: Compounds were assessed in ALK1-6 enzymatic assays. Specifically, compounds were assayed using LANCE® Ultra ULight technology (Perkin Elmer) against ...
Ligand InfoPC cidPC sid
In DepthDetails US Patent
TargetBone morphogenetic protein receptor type-1B(Homo sapiens (Human))
The Brigham And Women'S Hospital
US Patent
LigandPNGBDBM161932(US10017516, Compound 64 | US9682983, 64)
Affinity DataIC50:  6.41E+3nMpH: 7.5Assay Description:Specifically, compounds were assayed using LANCE® Ultra ULight¿ technology (Perkin Elmer) against human ALK1-6 enzymes (ALK1: Life Technologies, ALK2...
Ligand InfoPC cidPC sid
In DepthDetails US Patent