BDBM161959 US9051279, 66
SMILES CC[C@@H](C)Oc1cc2C(N(C(=O)Cc2cc1OC)c1ccc(cc1)C(C)N[C@H]1CC[C@H](N)CC1)c1ccc(Cl)cc1
InChI Key InChIKey=WDKPXBMAYNJPHO-QNKJKVLSSA-N
Data  2 IC50
  Tab Delimited (TSV)   2D SDfile   Computed 3D by Vconf -m prep SDfile
Find this compound or compounds like it in BindingDB:
Activity Spreadsheet -- Enzyme Inhibition Constant Data from BindingDB
Found 2 hits for monomerid = 161959
TargetProtein Mdm4(Homo sapiens (Human))
Novartis
US Patent
LigandPNGBDBM161959(US9051279, 66)
Affinity DataIC50:  6.75E+4nM. Assay description: The inhibition of p53-Hdm2 and p53-Hdm4 interactions is measured by time resolved fluorescence energy transfer (TR-FRET). Fluorescence energy transfe...
In DepthDetails US Patent
TargetE3 ubiquitin-protein ligase Mdm2(Homo sapiens (Human))
Novartis
US Patent
LigandPNGBDBM161959(US9051279, 66)
Affinity DataIC50:  106nM. Assay description: The inhibition of p53-Hdm2 and p53-Hdm4 interactions is measured by time resolved fluorescence energy transfer (TR-FRET). Fluorescence energy transfe...
In DepthDetails US Patent