BDBM16220 (2R)-2-(4-chlorophenyl)-2-[4-(1H-pyrazol-4-yl)phenyl]ethanamine::4-{4-[(1R)-1-(4-chlorophenyl)propyl]phenyl}-1H-pyrazole::pyrazole-based inhibitor 8a
SMILES NC[C@@H](c1ccc(Cl)cc1)c1ccc(cc1)-c1cn[nH]c1
InChI Key InChIKey=HWVGILTYGZFGLR-QGZVFWFLSA-N
Data  1 IC50
PDB links: 1 PDB ID matches this monomer.
  Tab Delimited (TSV)   2D SDfile   Computed 3D by Vconf -m prep SDfile
Find this compound or compounds like it in BindingDB:
Activity Spreadsheet -- Enzyme Inhibition Constant Data from BindingDB
Found 1 hit for monomerid = 16220
TargetRAC-beta serine/threonine-protein kinase(Homo sapiens (Human))
Astex
LigandPNGBDBM16220((2R)-2-(4-chlorophenyl)-2-[4-(1H-pyrazol-4-yl)phen...)
Affinity DataIC50:  34nMpH: 7.2 T: 2°C. Assay description: The purified PKB beta enzyme was assayed with a peptide substrate and test compound in the presence of 30 uM ATP/ [gamma-33P]ATP in 96-well plates. I...
In DepthDetails ArticlePubMed