BDBM16236 4-(3-pyridin-2-yl-1,2,4-oxadiazol-5-yl)butanoic acid::4-[3-(pyridin-2-yl)-1,2,4-oxadiazol-5-yl]butanoic acid::DP001247::Ligand 7
SMILES OC(=O)CCCc1nc(no1)-c1ccccn1
InChI Key InChIKey=BWRRWBIBNBVHQF-UHFFFAOYSA-N
Data  1 IC50
  Tab Delimited (TSV)   2D SDfile   Computed 3D by Vconf -m prep SDfile
Find this compound or compounds like it in BindingDB:
Activity Spreadsheet -- Enzyme Inhibition Constant Data from BindingDB
Found 1 hit for monomerid = 16236
TargetAldo-keto reductase family 1 member B1(Homo sapiens (Human))
University Of Marburg
LigandPNGBDBM16236(4-(3-pyridin-2-yl-1,2,4-oxadiazol-5-yl)butanoic ac...)
Affinity DataIC50:  1.24E+4nMpH: 6.2 T: 2°C. Assay description: The in vitro inhibitory activity of the candidate molecules was determined by recording the decrease of the NADPH absorbance upon enzymatic reduction...
In DepthDetails ArticlePubMed