BDBM162374 US9687479, 28 1-[(2-chlorophenyl)methyl]-3-(5-[(5-chlorothiophen-2-yl)methyl]amino-1-[(2-methoxyphenyl)carbonyl]-1H-pyrazol-3-yl)-1,2-dihydropyridin-2-one
SMILES COc1ccccc1C(=O)n1nc(cc1NCc1ccc(Cl)s1)-c1cccn(Cc2ccccc2Cl)c1=O
InChI Key InChIKey=ZYNLPQWLVFSHJV-UHFFFAOYSA-N
Data  1 IC50
  Tab Delimited (TSV)   2D SDfile   Computed 3D by Vconf -m prep SDfile
Find this compound or compounds like it in BindingDB:
Activity Spreadsheet -- Enzyme Inhibition Constant Data from BindingDB
Found 1 hit for monomerid = 162374
TargetProthrombin(Homo sapiens (Human))
Verseon
US Patent
LigandPNGBDBM162374(US9687479, 28 1-[(2-chlorophenyl)methyl]-3-(5-[(5-...)
Affinity DataIC50: <100nMpH: 7.4 T: 2°C. Assay description: Human thrombin was obtained from Haematologic Technologies Inc. The chromogenic substrate S-2238 was obtained from DiaPharma. Thrombin was assayed in...
Ligand InfoPC cidPC sid
In DepthDetails US Patent