BDBM16279 2-({2-[(3R)-3-aminopiperidin-1-yl]-6-bromo-4-oxo-3,4-dihydroquinazolin-3-yl}methyl)benzonitrile::quinazolinone-based inhibitor 1h
SMILES N[C@@H]1CCCN(C1)c1nc2ccc(Br)cc2c(=O)n1Cc1ccccc1C#N
InChI Key InChIKey=SNDYOAGMAZLRJN-QGZVFWFLSA-N
Data  2 IC50
  Tab Delimited (TSV)   2D SDfile   Computed 3D by Vconf -m prep SDfile
Find this compound or compounds like it in BindingDB:
Activity Spreadsheet -- Enzyme Inhibition Constant Data from BindingDB
Found 2 hits for monomerid = 16279
TargetDipeptidyl peptidase 8(Homo sapiens (Human))
Takeda Pharmaceutical
LigandPNGBDBM16279(2-({2-[(3R)-3-aminopiperidin-1-yl]-6-bromo-4-oxo-3...)
Affinity DataIC50: >1.00E+5nMpH: 7.4 T: 2°C. Assay description: Compounds were tested for their ability to inhibit DPP enzymes mediated cleavage of Ala-Pro-7-amido-4-trifluoromethylcoumarin in a fluorogenic assay....
In DepthDetails ArticlePubMed
TargetDipeptidyl peptidase 4(Homo sapiens (Human))
Takeda Pharmaceutical
LigandPNGBDBM16279(2-({2-[(3R)-3-aminopiperidin-1-yl]-6-bromo-4-oxo-3...)
Affinity DataIC50:  5nMpH: 7.4 T: 2°C. Assay description: Compounds were tested for their ability to inhibit DPP enzymes mediated cleavage of Ala-Pro-7-amido-4-trifluoromethylcoumarin in a fluorogenic assay....
In DepthDetails ArticlePubMed