BDBM162868 US9056859, 11
SMILES O=C(Cc1ccc(cc1)-n1cnnn1)N1CCCN(CCc2ccc3C(=O)OCc3c2)CC1
InChI Key InChIKey=UKNCNWUSFVBIRB-UHFFFAOYSA-N
Data  1 IC50
  Tab Delimited (TSV)   2D SDfile   Computed 3D by Vconf -m prep SDfile
Find this compound or compounds like it in BindingDB:
Activity Spreadsheet -- Enzyme Inhibition Constant Data from BindingDB
Found 1 hit for monomerid = 162868
TargetATP-sensitive inward rectifier potassium channel 1(Rattus norvegicus (Rat))
Merck Sharp & Dohme
US Patent
LigandPNGBDBM162868(US9056859, 11)
Affinity DataIC50:  12nMpH: 7.4Assay Description:Block of Kir1.1 (ROMKI) currents was examined by whole cell voltage clamp (Hamill et. al. Pfluegers Archives 391:85-100 (1981)) using the IonWorks Qu...
In DepthDetails US Patent